{"text_format":"1","workbook":"xlsx","n_sheets":47,"sheets":["Hoja1","guias","reglatecni","PAI","aprobacion","QUIENES","Portada Juridica","Portada Fisica","Paso 1","Paso 1 (2)","carta","carta (2)","Paso2","Paso2 (2)","Paso3","Paso3 (2)","Paso4","Paso4 (2)","Paso5","Paso5 (2)","Paso6","Paso6 (2)","Paso7","Paso7 (2)","Paso8","Paso8 (2)","Paso9","Paso9 (2)","Paso10","Paso10 (2)","Paso11","Paso11 (2)","Paso12","Paso12 (2)","Paso13","Paso13 (2)","Paso14","Paso14 (2)","Paso15","Paso15 (2)","Paso16","Paso17","ReqMayores","ReqMayores (2)","ReqMENORES (2)","ReqMENORES","Paso18"],"not_rendered":{"charts":0,"images":30,"macros":1,"external_links":0,"defined_names":207,"comments":5,"pivot_tables":0},"unopened":[],"bounds":{"document_bytes":16777216,"sheet_cells":100000,"rows_first":2000,"rows_last":500,"rows_between":2000,"halvings":0,"cell_chars":16384,"cell_head_chars":4096},"cells_cut":0,"cells_raw":0,"read":"whole","date_system":"1900"}

{"sheet":"Hoja1","index":0,"n_rows":1,"n_cols":1,"rows_kept":1,"cut":false,"hidden":false,"merged":[[14,5,17,5],[5,1,5,7],[0,0,4,10]]}
["Manual Instructivo de Ingreso al Programa de Abastecimiento Institucional (PAI)"]

{"sheet":"guias","index":1,"n_rows":13,"n_cols":2,"rows_kept":13,"cut":false,"hidden":false,"merged":[[5,1,5,7],[0,0,4,6]]}
["Manual Instructivo de Ingreso al Programa de Abastecimiento Institucional (PAI)"]
[]
[]
[]
[]
[null,"Para descargar los reglamentos técnicas darle clik a los enlaces de descargar, tiene que tener acceso a internet"]
{"$rows_left_out":8}
{"sheet":"reglatecni","index":2,"n_rows":16,"n_cols":4,"rows_kept":16,"cut":false,"hidden":false,"merged":[[5,1,5,7],[0,0,4,7]]}
["Manual Instructivo de Ingreso al Programa de Abastecimiento Institucional (PAI)"]
[]
[]
[]
[]
[null,"Para descargar los reglamentos técnicas darle clik a los enlaces de descargar, tiene que tener internet "]
{"$rows_left_out":11}
{"sheet":"PAI","index":3,"n_rows":15,"n_cols":7,"rows_kept":15,"cut":false,"hidden":false,"merged":[[21,6,25,9],[0,0,4,8],[12,6,12,9],[8,1,13,5],[14,1,19,5]]}
["Manual Instructivo de Ingreso al Programa de Abastecimiento Institucional (PAI)"]
[]
[]
[]
[]
[]
{"$rows_left_out":10}
{"sheet":"aprobacion","index":4,"n_rows":16,"n_cols":2,"rows_kept":16,"cut":false,"hidden":false,"merged":[[5,1,5,2],[21,6,25,9],[17,1,17,2],[0,0,4,7],[6,1,8,5],[9,1,10,5],[11,1,12,5],[15,1,16,5]]}
["Manual Instructivo de Ingreso al Programa de Abastecimiento Institucional (PAI)"]
[]
[]
[]
[]
[null,"Aprobación de la solicitud"]
{"$rows_left_out":11}
{"sheet":"QUIENES","index":5,"n_rows":15,"n_cols":7,"rows_kept":15,"cut":false,"hidden":false,"merged":[[5,1,5,7],[21,6,25,9],[0,0,4,8],[8,1,13,5],[14,1,18,5]]}
["Manual Instructivo de Ingreso al Programa de Abastecimiento Institucional (PAI)"]
[]
[]
[]
[]
[]
{"$rows_left_out":10}
{"sheet":"Portada Juridica","index":6,"n_rows":27,"n_cols":10,"rows_kept":27,"cut":false,"hidden":false,"merged":[[5,1,5,7],[14,5,17,5],[0,0,4,7],[5,8,5,10]]}
["Manual Instructivo de Ingreso al Programa de Abastecimiento Institucional (PAI)"]
[]
[]
[]
[]
[null,null,null,null,null,null,null,null,"Porcentaje de avance"]
{"$rows_left_out":22}
{"sheet":"Portada Fisica","index":7,"n_rows":21,"n_cols":10,"rows_kept":21,"cut":false,"hidden":false,"merged":[[14,5,17,5],[0,0,4,7],[5,8,5,10],[6,9,8,9]]}
["Manual Instructivo de Ingreso al Programa de Abastecimiento Institucional (PAI)"]
[]
[]
[]
[]
[null,true,null,null,null,null,null,null,"Porcentaje de avance"]
{"$rows_left_out":16}
{"sheet":"Paso 1","index":8,"n_rows":580,"n_cols":11,"rows_kept":580,"cut":false,"hidden":false,"merged":[[24,5,24,8],[14,5,17,5],[5,1,5,7],[0,0,4,2]]}
["Manual Instructivo de Ingreso al Programa de Abastecimiento Institucional (PAI)"]
[null,null,null,null,null,"Provincia","Cantón","Distrito","Región"]
[null,null,null,"Seleccione "]
[]
[]
["PASO 1.","Dirigir una carta a Dirección Regional del Consejo Nacional de Producción (CNP), en la cual diga los siguientes puntos. Por favor completelos aquí y selecciona la opción de generar carta."]
{"$rows_left_out":575}
{"sheet":"Paso 1 (2)","index":9,"n_rows":580,"n_cols":11,"rows_kept":580,"cut":false,"hidden":false,"merged":[[26,5,26,9],[27,5,27,8],[5,1,5,7],[6,5,9,5],[0,0,4,3]]}
["Manual Instructivo de Ingreso al Programa de Abastecimiento Institucional (PAI)"]
[null,null,null,null,null,"Provincia","Cantón","Distrito","Región"]
[null,null,null,null,"Seleccione "]
[]
[]
["PASO 1.","Dirigir una carta a Dirección Regional del Consejo Nacional de Producción (CNP), en la cual diga los siguientes puntos. Por favor completelos aquí y selecciona la opción de generar carta."]
{"$rows_left_out":575}
{"sheet":"carta","index":10,"n_rows":40,"n_cols":12,"rows_kept":40,"cut":false,"hidden":false,"merged":[[0,4,0,6],[0,11,0,13],[12,7,30,12]]}
[null,null,null,null,{"$f":"+TODAY()","v":"2019-10-09"},null,null,null,null,null,null,{"$f":"+TODAY()","v":"2019-10-09"}]
["Señor(a)",null,null,null,null,null,null,"Señor(a)"]
[{"$f":"+VLOOKUP(carta!B5,'Paso 1'!C89:D96,2,0)","v":{"$error":"#N/A"}},null,null,null,null,null,null,{"$f":"+VLOOKUP(carta!I5,'Paso 1'!I89:J94,2,0)","v":{"$error":"#N/A"}}]
["Dirección Regional del Consejo Nacional de Producción ",null,null,null,null,null,null,"Dirección Regional del Consejo Nacional de Producción "]
["Región",{"$f":"+'Paso 1'!I3","v":0},null,null,null,null,null,"Región",{"$f":"+'Paso 1'!P3","v":0}]
[]
{"$rows_left_out":35}
{"sheet":"carta (2)","index":11,"n_rows":40,"n_cols":12,"rows_kept":40,"cut":false,"hidden":false,"merged":[[0,4,0,6],[0,11,0,13],[12,7,30,12]]}
[null,null,null,null,{"$f":"+TODAY()","v":"2019-10-09"},null,null,null,null,null,null,{"$f":"+TODAY()","v":"2019-10-09"}]
["Señor(a)",null,null,null,null,null,null,"Señor(a)"]
[{"$f":"+VLOOKUP('carta (2)'!B5,'Paso 1 (2)'!C89:D96,2,0)","v":{"$error":"#N/A"}},null,null,null,null,null,null,{"$f":"+A3","v":{"$error":"#N/A"}}]
["Dirección Regional del Consejo Nacional de Producción ",null,null,null,null,null,null,"Dirección Regional del Consejo Nacional de Producción "]
["Región",{"$f":"+'Paso 1 (2)'!I3","v":0},null,null,null,null,null,"Región",{"$f":"+B5","v":0}]
[]
{"$rows_left_out":35}
{"sheet":"Paso2","index":12,"n_rows":20,"n_cols":3,"rows_kept":20,"cut":false,"hidden":false,"merged":[[15,5,18,5],[22,6,26,9],[5,1,5,7],[0,0,4,6]]}
["Manual Instructivo de Ingreso al Programa de Abastecimiento Institucional (PAI)"]
[]
[]
[]
[]
["PASO 2.","Fotocopia o certificación de cédula jurídica  "]
{"$rows_left_out":15}
{"sheet":"Paso2 (2)","index":13,"n_rows":18,"n_cols":2,"rows_kept":18,"cut":false,"hidden":false,"merged":[[5,1,5,7],[14,5,17,5],[21,6,25,9],[0,0,4,10]]}
["Manual Instructivo de Ingreso al Programa de Abastecimiento Institucional (PAI)"]
[]
[]
[]
[]
["PASO 2.","Fotocopia  de cédula  "]
{"$rows_left_out":13}
{"sheet":"Paso3","index":14,"n_rows":18,"n_cols":2,"rows_kept":18,"cut":false,"hidden":false,"merged":[[5,1,5,7],[14,5,17,5],[21,6,25,9],[0,0,4,6],[0,7,4,9]]}
["Manual Instructivo de Ingreso al Programa de Abastecimiento Institucional (PAI)"]
[]
[]
[]
[]
["PASO 3.","Fotocopia o certificación de cédula del representante legal   "]
{"$rows_left_out":13}
{"sheet":"Paso3 (2)","index":15,"n_rows":16,"n_cols":4,"rows_kept":16,"cut":false,"hidden":false,"merged":[[15,5,18,5],[22,6,26,9],[0,0,4,6],[0,7,4,9],[5,1,5,2]]}
["Manual Instructivo de Ingreso al Programa de Abastecimiento Institucional (PAI)"]
[]
[]
[]
[]
["PASO 3.","Certificación de Contador Público Autorizado (CPA) ",null," -- Costo aproximado de ₡ 110 000 -- "]
{"$rows_left_out":11}
{"sheet":"Paso4","index":16,"n_rows":16,"n_cols":4,"rows_kept":16,"cut":false,"hidden":false,"merged":[[15,5,18,5],[22,6,26,9],[0,0,4,6],[0,7,4,9],[5,1,5,2]]}
["Manual Instructivo de Ingreso al Programa de Abastecimiento Institucional (PAI)"]
[]
[]
[]
[]
["PASO 4.","Certificación de Contador Público Autorizado (CPA) ",null," -- Costo aproximado de ₡ 110 000 -- "]
{"$rows_left_out":11}
{"sheet":"Paso4 (2)","index":17,"n_rows":20,"n_cols":3,"rows_kept":20,"cut":false,"hidden":false,"merged":[[14,5,17,5],[0,0,4,7],[5,1,5,7],[8,1,8,2],[12,1,12,2],[13,0,13,1]]}
["Manual Instructivo de Ingreso al Programa de Abastecimiento Institucional (PAI)"]
[]
[]
[]
[]
["PASO 4.","Presentar Declaración Jurada Autorizada "]
{"$rows_left_out":15}
{"sheet":"Paso5","index":18,"n_rows":20,"n_cols":7,"rows_kept":20,"cut":false,"hidden":false,"merged":[[0,0,4,7],[0,8,4,10],[5,1,5,7],[14,5,17,5],[12,1,12,2],[13,0,13,1],[9,1,9,2]]}
["Manual Instructivo de Ingreso al Programa de Abastecimiento Institucional (PAI)"]
[]
[]
[]
[]
["PASO 5.","Presentar Declaración Jurada Autorizada "]
{"$rows_left_out":15}
{"sheet":"Paso5 (2)","index":19,"n_rows":17,"n_cols":7,"rows_kept":17,"cut":false,"hidden":false,"merged":[[5,1,5,7],[0,0,4,7],[0,8,4,8],[16,0,16,2],[6,1,6,5]]}
["Manual Instructivo de Ingreso al Programa de Abastecimiento Institucional (PAI)"]
[null,null,null,null,null,null,"Página Web"]
[]
[]
[]
["PASO 5.","Certificación de la Dirección General de Hacienda, de encontrarse debidamente inscrita en en Ministerio de Hacienda o la certificación de exención de impuestos."]
{"$rows_left_out":12}
{"sheet":"Paso6","index":20,"n_rows":17,"n_cols":7,"rows_kept":17,"cut":false,"hidden":false,"merged":[[5,1,5,7],[0,0,4,7],[0,8,4,8],[6,1,6,5],[16,0,16,2]]}
["Manual Instructivo de Ingreso al Programa de Abastecimiento Institucional (PAI)"]
[null,null,null,null,null,null,"Página Web"]
[]
[]
[]
["PASO 6.","Certificación de la Dirección General de Hacienda, de encontrarse debidamente inscrita en en Ministerio de Hacienda o la certificación de exención de impuestos."]
{"$rows_left_out":12}
{"sheet":"Paso6 (2)","index":21,"n_rows":18,"n_cols":2,"rows_kept":18,"cut":false,"hidden":false,"merged":[[10,1,11,2],[14,5,17,5],[0,0,4,7],[0,8,4,8],[0,9,4,9],[9,1,9,2],[5,1,5,7],[7,1,8,2]]}
["Manual Instructivo de Ingreso al Programa de Abastecimiento Institucional (PAI)"]
[]
[]
[]
[]
["PASO 6.","Certificación o constancia que está al día en el pago de las cuotas obrero-patronal con la CCSS"]
{"$rows_left_out":13}
{"sheet":"Paso7","index":22,"n_rows":19,"n_cols":6,"rows_kept":19,"cut":false,"hidden":false,"merged":[[0,0,4,7],[5,1,5,7],[14,5,17,5],[21,6,25,9],[7,1,8,2],[9,1,10,2],[11,1,14,2]]}
["Manual Instructivo de Ingreso al Programa de Abastecimiento Institucional (PAI)"]
[]
[]
[]
[]
["PASO 7.","Certificación de personería jurídica."]
{"$rows_left_out":14}
{"sheet":"Paso7 (2)","index":23,"n_rows":16,"n_cols":2,"rows_kept":16,"cut":false,"hidden":false,"merged":[[0,0,4,7],[14,5,17,5],[5,1,5,7],[8,1,9,3],[10,1,11,2],[12,1,13,2]]}
["Manual Instructivo de Ingreso al Programa de Abastecimiento Institucional (PAI)"]
[]
[]
[]
[]
["PASO 7.","Comprobante de que se encuentra al día en la póliza de trabajo"]
{"$rows_left_out":11}
{"sheet":"Paso8","index":24,"n_rows":19,"n_cols":2,"rows_kept":19,"cut":false,"hidden":false,"merged":[[0,0,4,7],[21,6,25,9],[10,1,11,2],[5,1,5,7],[7,1,8,2],[14,5,17,5]]}
["Manual Instructivo de Ingreso al Programa de Abastecimiento Institucional (PAI)"]
[]
[]
[]
[]
["PASO 8.","Certificación o constancia que está al día en el pago de las cuotas obrero-patronal con la CCSS"]
{"$rows_left_out":14}
{"sheet":"Paso8 (2)","index":25,"n_rows":18,"n_cols":3,"rows_kept":18,"cut":false,"hidden":false,"merged":[[0,0,4,7],[5,1,5,7],[7,1,8,2],[9,1,9,2],[14,5,17,5]]}
["Manual Instructivo de Ingreso al Programa de Abastecimiento Institucional (PAI)"]
[]
[]
[]
[]
["PASO 8.","Certificación o constancia de que la empresa se encuentra al día en FODESAF  "]
{"$rows_left_out":13}
{"sheet":"Paso9","index":26,"n_rows":18,"n_cols":3,"rows_kept":18,"cut":false,"hidden":false,"merged":[[0,0,4,6],[21,6,25,9],[9,1,9,2],[5,1,5,7],[7,1,8,2],[14,5,17,5]]}
["Manual Instructivo de Ingreso al Programa de Abastecimiento Institucional (PAI)"]
[]
[]
[]
[]
["PASO 9.","Certificación o constancia de que la empresa se encuentra al día en FODESAF  "]
{"$rows_left_out":13}
{"sheet":"Paso9 (2)","index":27,"n_rows":18,"n_cols":2,"rows_kept":18,"cut":false,"hidden":false,"merged":[[5,1,5,7],[0,0,4,6]]}
["Manual Instructivo de Ingreso al Programa de Abastecimiento Institucional (PAI)"]
[]
[]
[]
[]
["PASO 9.","Fotocopia de servicio sanitario otorgado por el Ministerio de Salud "]
{"$rows_left_out":13}
{"sheet":"Paso10","index":28,"n_rows":18,"n_cols":7,"rows_kept":18,"cut":false,"hidden":false,"merged":[[0,0,4,6],[21,6,25,9],[8,1,9,3],[10,1,11,2],[12,1,13,2],[5,1,5,7],[14,5,17,5]]}
["Manual Instructivo de Ingreso al Programa de Abastecimiento Institucional (PAI)"]
[null,null,null,null,null,null,"Página Web"]
[]
[]
[]
["PASO 10.","Comprobante de que se encuentra al día en la póliza de trabajo"]
{"$rows_left_out":13}
{"sheet":"Paso10 (2)","index":29,"n_rows":11,"n_cols":2,"rows_kept":11,"cut":false,"hidden":false,"merged":[[5,1,5,7],[8,1,9,2],[14,5,17,5],[0,0,4,7],[10,1,11,2]]}
["Manual Instructivo de Ingreso al Programa de Abastecimiento Institucional (PAI)"]
[]
[]
[]
[]
["PASO 10.","Presentar certificación bancaria que indique número de cuenta cliente"]
{"$rows_left_out":6}
{"sheet":"Paso11","index":30,"n_rows":18,"n_cols":2,"rows_kept":18,"cut":false,"hidden":false,"merged":[[5,1,5,7],[0,0,4,6]]}
["Manual Instructivo de Ingreso al Programa de Abastecimiento Institucional (PAI)"]
[]
[]
[]
[]
["PASO 11.","Fotocopia de servicio sanitario otorgado por el Ministerio de Salud "]
{"$rows_left_out":13}
{"sheet":"Paso11 (2)","index":31,"n_rows":314,"n_cols":22,"rows_kept":314,"cut":false,"hidden":false,"merged":[[294,3,298,4],[299,3,303,4],[304,3,308,4],[309,3,313,4],[261,3,266,4],[268,3,272,4],[273,3,277,4],[278,3,282,4],[283,3,287,4],[288,3,292,4],[256,3,260,4],[224,1,225,3],[224,4,225,4],[226,1,226,3],[226,4,231,4],[227,1,227,3],[228,1,228,3],[229,1,229,3],[230,1,230,3],[231,1,231,3],[233,3,237,4],[238,3,242,4],[243,3,247,4],[248,3,249,4],[251,3,255,4],[218,1,218,3],[218,4,223,4],[219,1,219,3],[220,1,220,3],[221,1,221,3],[222,1,222,3],[223,1,223,3],[212,1,212,3],[212,4,217,4],[213,1,213,3],[214,1,214,3],[215,1,215,3],[216,1,216,3],[217,1,217,3],[0,0,4,6],[199,1,204,3],[199,4,204,4],[205,1,210,3],[205,4,210,4],[196,1,198,3],[196,4,198,4],[5,1,5,7],[8,1,14,3],[15,1,19,3]]}
["Manual Instructivo de Ingreso al Programa de Abastecimiento Institucional (PAI)"]
[]
[]
[]
[]
["PASO 11.","Actividad Pecuaria CVO de SENASA"]
{"$rows_left_out":309}
{"sheet":"Paso12","index":32,"n_rows":49,"n_cols":6,"rows_kept":49,"cut":false,"hidden":false,"merged":[[21,6,25,9],[7,1,7,3],[9,1,9,2],[0,0,4,4],[14,5,17,5],[11,0,12,0],[5,1,5,2],[12,1,12,3],[13,2,13,4],[14,2,14,4],[15,2,15,4]]}
["Manual Instructivo de Ingreso al Programa de Abastecimiento Institucional (PAI)"]
[]
[]
[]
[]
["PASO 12.","Presentar certificación de Administración tributaria "]
{"$rows_left_out":44}
{"sheet":"Paso12 (2)","index":33,"n_rows":59,"n_cols":7,"rows_kept":59,"cut":false,"hidden":false,"merged":[[5,1,5,7],[14,0,15,0],[0,0,4,8]]}
["Manual Instructivo de Ingreso al Programa de Abastecimiento Institucional (PAI)"]
[]
[]
[]
[]
["PASO 12.","Productos Acuícolas y pesqueros, certificación extendida de INCOPESCA"]
{"$rows_left_out":54}
{"sheet":"Paso13","index":34,"n_rows":9,"n_cols":2,"rows_kept":9,"cut":false,"hidden":false,"merged":[[21,6,25,9],[8,1,9,2],[5,1,5,7],[14,5,17,5],[0,0,4,6]]}
["Manual Instructivo de Ingreso al Programa de Abastecimiento Institucional (PAI)"]
[]
[]
[]
[]
["PASO 13.","Presentar certificación bancaria que indique número de cuenta cliente"]
{"$rows_left_out":4}
{"sheet":"Paso13 (2)","index":35,"n_rows":14,"n_cols":2,"rows_kept":14,"cut":false,"hidden":false,"merged":[[5,1,5,7],[8,1,12,2],[0,0,4,6],[13,1,15,2]]}
["Manual Instructivo de Ingreso al Programa de Abastecimiento Institucional (PAI)"]
[]
[]
[]
[]
["PASO 13.","Individual que procesen en plantas de terceros o se suplan de productos con terceros "]
{"$rows_left_out":9}
{"sheet":"Paso14","index":36,"n_rows":314,"n_cols":22,"rows_kept":314,"cut":false,"hidden":false,"merged":[[243,3,247,4],[248,3,249,4],[233,3,237,4],[278,3,282,4],[283,3,287,4],[268,3,272,4],[273,3,277,4],[251,3,255,4],[256,3,260,4],[261,3,266,4],[238,3,242,4],[299,3,303,4],[304,3,308,4],[309,3,313,4],[288,3,292,4],[294,3,298,4],[224,1,225,3],[224,4,225,4],[226,1,226,3],[227,1,227,3],[218,1,218,3],[219,1,219,3],[220,1,220,3],[221,1,221,3],[222,1,222,3],[228,1,228,3],[229,1,229,3],[230,1,230,3],[231,1,231,3],[226,4,231,4],[199,1,204,3],[199,4,204,4],[223,1,223,3],[205,1,210,3],[205,4,210,4],[212,1,212,3],[213,1,213,3],[214,1,214,3],[215,1,215,3],[216,1,216,3],[217,1,217,3],[212,4,217,4],[218,4,223,4],[0,0,4,6],[5,1,5,7],[8,1,14,3],[15,1,19,3],[196,1,198,3],[196,4,198,4]]}
["Manual Instructivo de Ingreso al Programa de Abastecimiento Institucional (PAI)"]
[]
[]
[]
[]
["PASO 14.","Actividad Pecuaria CVO de SENASA"]
{"$rows_left_out":309}
{"sheet":"Paso14 (2)","index":37,"n_rows":16,"n_cols":4,"rows_kept":16,"cut":false,"hidden":false,"merged":[[0,0,4,6],[9,1,10,1],[5,1,5,4],[12,1,13,2],[15,0,17,1]]}
["Manual Instructivo de Ingreso al Programa de Abastecimiento Institucional (PAI)"]
[]
[]
[]
[]
["PASO 14.","Aprobar la inspección técnica que realiza la Dirección de Calidad e Inocuidad"]
{"$rows_left_out":11}
{"sheet":"Paso15","index":38,"n_rows":59,"n_cols":3,"rows_kept":59,"cut":false,"hidden":false,"merged":[[5,1,5,7],[14,0,15,0],[0,0,4,7]]}
["Manual Instructivo de Ingreso al Programa de Abastecimiento Institucional (PAI)"]
[]
[]
[]
[]
["PASO 15.","Productos Acuícolas y pesqueros, certificación extendida de INCOPESCA"]
{"$rows_left_out":54}
{"sheet":"Paso15 (2)","index":39,"n_rows":19,"n_cols":6,"rows_kept":19,"cut":false,"hidden":false,"merged":[[0,0,4,6],[5,1,5,5]]}
["Manual Instructivo de Ingreso al Programa de Abastecimiento Institucional (PAI)"]
[null,null,null,null,null,"Página Web"]
[]
[]
[]
["PASO 15.","Calificación de la empresa de las MiPyMES del MEIC"]
{"$rows_left_out":14}
{"sheet":"Paso16","index":40,"n_rows":14,"n_cols":2,"rows_kept":14,"cut":false,"hidden":false,"merged":[[8,1,12,2],[5,1,5,7],[0,0,4,6],[13,1,14,2]]}
["Manual Instructivo de Ingreso al Programa de Abastecimiento Institucional (PAI)"]
[]
[]
[]
[]
["PASO 16.","Individual que procesen en plantas de terceros o se suplan de productos con terceros "]
{"$rows_left_out":9}
{"sheet":"Paso17","index":41,"n_rows":15,"n_cols":4,"rows_kept":15,"cut":false,"hidden":false,"merged":[[14,1,16,1],[0,0,4,6],[8,1,9,1],[11,1,12,1],[5,1,5,5]]}
["Manual Instructivo de Ingreso al Programa de Abastecimiento Institucional (PAI)"]
[]
[]
[]
[]
["PASO 17.","Aprobar la inspección técnica que realiza la Dirección de Calidad e Inocuidad"]
{"$rows_left_out":10}
{"sheet":"ReqMayores","index":42,"n_rows":42,"n_cols":9,"rows_kept":42,"cut":false,"hidden":false,"merged":[[0,0,2,6],[34,1,34,3],[4,1,4,3],[16,1,16,3],[20,1,20,3],[23,1,23,3]]}
["Requisitos Mayores"]
[]
[]
[null,"Punto de Control","Criterio de cumplimiento","Cumplimiento"]
[null,"1. Recibo del producto"]
[null,"1.1 ¿Se cuenta con una lista de productores activos y actualizada por región y el estimado de la cantidad de producción?","Verificar la información. Debe estar el número de cédula fisica o jurídica",null,{"$f":"+IF(OR(D6=\"Sí\",D6=\"No aplica\"),1,\"0\")","v":"0"},{"$f":"+COUNT(E6:E42)","v":0},"Cumplimiento","Nota obtenida","Nota permitida"]
{"$rows_left_out":37}
{"sheet":"ReqMayores (2)","index":43,"n_rows":42,"n_cols":9,"rows_kept":42,"cut":false,"hidden":false,"merged":[[0,6,2,10],[34,1,34,3],[0,0,2,5],[4,1,4,3],[16,1,16,3],[20,1,20,3],[23,1,23,3]]}
["Requisitos Mayores"]
[]
[]
[null,"Punto de Control","Criterio de cumplimiento","Cumplimiento"]
[null,"1. Recibo del producto"]
[null,"1.1 ¿Se cuenta con una lista de productores activos y actualizada por región y el estimado de la cantidad de producción?","Verificar la información. Debe estar el número de cédula fisica o jurídica",null,{"$f":"+IF(OR(D6=\"Sí\",D6=\"No aplica\"),1,\"0\")","v":"0"},{"$f":"+COUNT(E6:E42)","v":0},"Cumplimiento","Nota obtenida","Nota permitida"]
{"$rows_left_out":37}
{"sheet":"ReqMENORES (2)","index":44,"n_rows":42,"n_cols":9,"rows_kept":42,"cut":false,"hidden":false,"merged":[[40,1,40,3],[25,1,25,3],[26,1,26,3],[29,1,29,3],[31,1,31,3],[37,1,37,3],[0,6,2,9],[22,1,22,3],[0,0,2,5],[4,1,4,3],[11,1,11,3],[13,1,13,3],[16,1,16,3]]}
["Requisitos Menores"]
[]
[]
[null,"Punto de Control","Criterio de cumplimiento","Cumplimiento"]
[null,"2.  Análisis de calidades "]
[null,"2.1 ¿Existe un procedimiento documentado para determinar la calidad del producto y/o materia prima?","Pedir procedimiento escrito",null,{"$f":"+IF(OR(D6=\"Sí\",D6=\"No aplica\"),1,\"0\")","v":"0"},{"$f":"+COUNT(E6:E42)","v":0},"Cumplimiento","Nota obtenida","Nota permitida"]
{"$rows_left_out":37}
{"sheet":"ReqMENORES","index":45,"n_rows":42,"n_cols":9,"rows_kept":42,"cut":false,"hidden":false,"merged":[[0,6,2,6],[40,1,40,3],[0,0,2,5],[4,1,4,3],[16,1,16,3],[22,1,22,3],[37,1,37,3],[11,1,11,3],[13,1,13,3],[25,1,25,3],[26,1,26,3],[29,1,29,3],[31,1,31,3]]}
["Requisitos Menores"]
[]
[]
[null,"Punto de Control","Criterio de cumplimiento","Cumplimiento"]
[null,"2.  Análisis de calidades "]
[null,"2.1 ¿Existe un procedimiento documentado para determinar la calidad del producto y/o materia prima?","Pedir procedimiento escrito",null,{"$f":"+IF(OR(D6=\"Sí\",D6=\"No aplica\"),1,\"0\")","v":"0"},{"$f":"+COUNT(E6:E42)","v":0},"Cumplimiento","Nota obtenida","Nota permitida"]
{"$rows_left_out":37}
{"sheet":"Paso18","index":46,"n_rows":19,"n_cols":4,"rows_kept":19,"cut":false,"hidden":false,"merged":[[0,0,4,6],[5,1,5,5]]}
["Manual Instructivo de Ingreso al Programa de Abastecimiento Institucional (PAI)"]
[]
[]
[]
[]
["PASO 18.","Calificación de la empresa de las MiPyMES del MEIC"]
{"$rows_left_out":13}